Target
T cell receptor alpha variable 4
Ligand
BDBM55150
Substrate
IC50
2242±n/a nM
Citation
 PubChem, PC Fluorescence-based biochemical primary high throughput dose response assay to identify inhibitors of T-cell receptor (TCR)-CD3 interaction using a TAMRA-labeled TCR probe PubChem Bioassay (2013)[AID] 
Target
Name:
T cell receptor alpha variable 4
Synonyms:
TCRAV4S1 TVA4_HUMAN
Type:
Enzyme Catalytic Domain
Mol. Mass.:
12216.28
Organism:
Homo sapiens (Human)
Description:
A0A0B4J268
Residue:
109
  
Inhibitor
Name:
BDBM55150
Synonyms:
(4Z)-2-hydroxy-4-[[2-[(Z)-(3-hydroxy-4-oxocyclohexa-2,5-dien-1-ylidene)methyl]hydrazinyl]methylidene]cyclohexa-2,5-dien-1-one (4Z)-2-hydroxy-4-[[[(Z)-(3-hydroxy-4-oxo-1-cyclohexa-2,5-dienylidene)methyl]hydrazo]methylidene]-1-cyclohexa-2,5-dienone MLS001211916 The compound has not trivial name. | cid_6614358
Type:
Small organic molecule
Emp. Form.:
C14H12N2O4
Mol. Mass.:
272.2561
SMILES:
Oc1ccc(C=NN=Cc2ccc(O)c(O)c2)cc1O
: