Target
T cell receptor alpha variable 4
Ligand
BDBM76224
Substrate
IC50
>94035±n/a nM
Citation
 PubChem, PC Fluorescence-based biochemical primary high throughput dose response assay to identify inhibitors of T-cell receptor (TCR)-CD3 interaction using a TAMRA-labeled TCR probe PubChem Bioassay (2013)[AID] 
Target
Name:
T cell receptor alpha variable 4
Synonyms:
TCRAV4S1 TVA4_HUMAN
Type:
Enzyme Catalytic Domain
Mol. Mass.:
12216.28
Organism:
Homo sapiens (Human)
Description:
A0A0B4J268
Residue:
109
  
Inhibitor
Name:
BDBM76224
Synonyms:
MLS001147398 N-[[(4-hydroxybenzoyl)amino]thiocarbamoyl]thiophene-2-carboxamide N-[[[(4-hydroxyphenyl)-oxomethyl]hydrazo]-sulfanylidenemethyl]-2-thiophenecarboxamide SMR000673126 | cid_1818307
Type:
Small organic molecule
Emp. Form.:
C13H11N3O3S2
Mol. Mass.:
321.375
SMILES:
Oc1ccc(cc1)C(=O)NNC(=S)NC(=O)c1cccs1
: