Target
Albumin
Ligand
BDBM53205
Substrate
IC50
>94065±n/a nM
Citation
 PubChem, PC Counterscreen for inhibitors of T-cell receptor (TCR)-CD3 interaction: Fluorescence-based biochemical high throughput dose response assay to identify inhibitors of T-cell receptor (TCR)-CD3 interaction using a TAMRA-labeled BSA probe PubChem Bioassay (2013)[AID] 
Target
Name:
Albumin
Synonyms:
ALB Serum albumin | serum albumin precursor
Type:
PROTEIN
Mol. Mass.:
69288.15
Organism:
Bos taurus
Description:
ChEMBL_1502598
Residue:
607
  
Inhibitor
Name:
BDBM53205
Synonyms:
1,3-bis[[(Z)-(3-hydroxy-4-keto-cyclohexa-2,5-dien-1-ylidene)methyl]amino]urea 1,3-bis[[(Z)-(3-hydroxy-4-oxocyclohexa-2,5-dien-1-ylidene)methyl]amino]urea MLS001202140 SMR000565039 | cid_24762014
Type:
Small organic molecule
Emp. Form.:
C15H14N4O5
Mol. Mass.:
330.2955
SMILES:
O=C(NN=CC1=CC(=O)C(=O)CC1)NN=CC1=CC(=O)C(=O)CC1
: