Target
Huntingtin
Ligand
BDBM40201
Substrate
IC50
3950±n/a nM
Citation
 PubChem, PC Fluorescence-based biochemical high throughput dose response assay to identify molecules that bind r(CAG) RNA repeats PubChem Bioassay (2013)[AID] 
Target
Name:
Huntingtin
Synonyms:
HD HD_HUMAN Homo sapiens huntingtin (HTT), mRNA Huntington disease protein | IT15
Type:
PROTEIN
Mol. Mass.:
347579.69
Organism:
Homo sapiens (Human)
Description:
EBI_101216
Residue:
3142
  
Inhibitor
Name:
BDBM40201
Synonyms:
5-(4-fluorophenyl)-N-(4-methoxy-1,3-benzothiazol-2-yl)-1,3,4-oxadiazol-2-amine SMR000126937 cid_7109931
Type:
Small organic molecule
Emp. Form.:
C16H11FN4O2S
Mol. Mass.:
342.348
SMILES:
COc1cccc2sc(Nc3nnc(o3)-c3ccc(F)cc3)nc12
: