Target
Huntingtin
Ligand
BDBM60618
Substrate
IC50
1762±n/a nM
Citation
 PubChem, PC Fluorescence-based biochemical high throughput dose response assay to identify molecules that bind r(CAG) RNA repeats PubChem Bioassay (2013)[AID] 
Target
Name:
Huntingtin
Synonyms:
HD HD_HUMAN Homo sapiens huntingtin (HTT), mRNA Huntington disease protein | IT15
Type:
PROTEIN
Mol. Mass.:
347579.69
Organism:
Homo sapiens (Human)
Description:
EBI_101216
Residue:
3142
  
Inhibitor
Name:
BDBM60618
Synonyms:
(E)-4-[[4-(4-tert-butylphenyl)-3-carbethoxy-5-methyl-2-thienyl]amino]-4-keto-but-2-enoic acid (E)-4-[[4-(4-tert-butylphenyl)-3-ethoxycarbonyl-5-methyl-thiophen-2-yl]amino]-4-oxidanylidene-but-2-enoic acid 4-{[4-(4-tert-butylphenyl)-3-(ethoxycarbonyl)-5-methyl-2-thienyl]amino}-4-oxo-2-butenoic acid SMR000299199 | cid_2167819
Type:
Small organic molecule
Emp. Form.:
C22H25NO5S
Mol. Mass.:
415.503
SMILES:
CCOC(=O)c1c(NC(=O)\C=C\C(O)=O)sc(C)c1-c1ccc(cc1)C(C)(C)C
: