Target
Huntingtin
Ligand
BDBM66537
Substrate
IC50
12327±n/a nM
Citation
 PubChem, PC Fluorescence-based biochemical high throughput dose response assay to identify molecules that bind r(CAG) RNA repeats PubChem Bioassay (2013)[AID] 
Target
Name:
Huntingtin
Synonyms:
HD HD_HUMAN Homo sapiens huntingtin (HTT), mRNA Huntington disease protein | IT15
Type:
PROTEIN
Mol. Mass.:
347579.69
Organism:
Homo sapiens (Human)
Description:
EBI_101216
Residue:
3142
  
Inhibitor
Name:
BDBM66537
Synonyms:
2-[(3-carbethoxy-4,5,6,7-tetrahydrobenzothiophen-2-yl)carbamoyl]bicyclo[2.2.1]hept-5-ene-3-carboxylic acid 2-[[(3-ethoxycarbonyl-4,5,6,7-tetrahydro-1-benzothiophen-2-yl)amino]-oxomethyl]-3-bicyclo[2.2.1]hept-5-enecarboxylic acid MLS000676702 cid_2893903
Type:
Small organic molecule
Emp. Form.:
C20H23NO5S
Mol. Mass.:
389.465
SMILES:
[H]C12CC([H])(C=C1)C(C2C(O)=O)C(=O)Nc1sc2CCCCc2c1C(=O)OCC
: