Target
Huntingtin
Ligand
BDBM70228
Substrate
IC50
1063±n/a nM
Citation
 PubChem, PC Fluorescence-based biochemical high throughput dose response assay to identify molecules that bind r(CAG) RNA repeats PubChem Bioassay (2013)[AID] 
Target
Name:
Huntingtin
Synonyms:
HD HD_HUMAN Homo sapiens huntingtin (HTT), mRNA Huntington disease protein | IT15
Type:
PROTEIN
Mol. Mass.:
347579.69
Organism:
Homo sapiens (Human)
Description:
EBI_101216
Residue:
3142
  
Inhibitor
Name:
BDBM70228
Synonyms:
3-[5-[(Z)-(5-azanylidene-7-oxidanylidene-3-propan-2-ylsulfonyl-[1,2,4]thiadiazolo[4,5-a]pyrimidin-6-ylidene)methyl]furan-2-yl]benzoic acid 3-[5-[(Z)-(5-imino-7-oxo-3-propan-2-ylsulfonyl-[1,2,4]thiadiazolo[4,5-a]pyrimidin-6-ylidene)methyl]-2-furanyl]benzoic acid MLS-0264081.0001 | cid_16195402
Type:
Small organic molecule
Emp. Form.:
C20H16N4O6S2
Mol. Mass.:
472.494
SMILES:
CC(C)S(=O)(=O)C1=NSC2=NC(=O)\C(=C/c3ccc(o3)-c3cccc(c3)C(O)=O)C(=N)N12
: