Target
Huntingtin
Ligand
BDBM54149
Substrate
IC50
1064±n/a nM
Citation
 PubChem, PC Fluorescence-based biochemical high throughput dose response assay to identify molecules that bind r(CAG) RNA repeats PubChem Bioassay (2013)[AID] 
Target
Name:
Huntingtin
Synonyms:
HD HD_HUMAN Homo sapiens huntingtin (HTT), mRNA Huntington disease protein | IT15
Type:
PROTEIN
Mol. Mass.:
347579.69
Organism:
Homo sapiens (Human)
Description:
EBI_101216
Residue:
3142
  
Inhibitor
Name:
BDBM54149
Synonyms:
5-(3-thienyl)-3-({[4-(trifluoromethyl)phenyl]sulfonyl}amino)thiophene-2-carboxamide 5-(3-thiophenyl)-3-[[4-(trifluoromethyl)phenyl]sulfonylamino]-2-thiophenecarboxamide MLS000849945 cid_2807878
Type:
Small organic molecule
Emp. Form.:
C16H11F3N2O3S3
Mol. Mass.:
432.46
SMILES:
NC(=O)c1sc(cc1NS(=O)(=O)c1ccc(cc1)C(F)(F)F)-c1ccsc1
: