Target
Huntingtin
Ligand
BDBM96492
Substrate
IC50
1673±n/a nM
Citation
 PubChem, PC Fluorescence-based biochemical high throughput dose response assay to identify molecules that bind r(CAG) RNA repeats PubChem Bioassay (2013)[AID] 
Target
Name:
Huntingtin
Synonyms:
HD HD_HUMAN Homo sapiens huntingtin (HTT), mRNA Huntington disease protein | IT15
Type:
PROTEIN
Mol. Mass.:
347579.69
Organism:
Homo sapiens (Human)
Description:
EBI_101216
Residue:
3142
  
Inhibitor
Name:
BDBM96492
Synonyms:
2-[[5-cyano-6-(2-furanyl)-4-oxo-1H-pyrimidin-2-yl]thio]-N-(4-ethylphenyl)propanamide 2-[[5-cyano-6-(furan-2-yl)-4-oxidanylidene-1H-pyrimidin-2-yl]sulfanyl]-N-(4-ethylphenyl)propanamide MLS001179702 cid_4857906
Type:
Small organic molecule
Emp. Form.:
C20H18N4O3S
Mol. Mass.:
394.447
SMILES:
CCc1ccc(NC(=O)C(C)Sc2nc(-c3ccco3)c(C#N)c(=O)[nH]2)cc1
: