Target
Guanine nucleotide-binding protein subunit alpha-15
Ligand
BDBM96565
Substrate
EC50
>29910±n/a nM
Citation
 PubChem, PC Counterscreen for agonists of the human trace amine associated receptor 1 (TAAR1): Fluorescence-based cell-based high throughput dose response assay to identify nonselective Ga16 agonists PubChem Bioassay (2013)[AID] 
Target
Name:
Guanine nucleotide-binding protein subunit alpha-15
Synonyms:
G-protein subunit alpha-16 GNA15 GNA16 | guanine nucleotide-binding protein subunit alpha-15
Type:
Protein
Mol. Mass.:
43577.62
Organism:
Homo sapiens (Human)
Description:
P30679
Residue:
374
  
Inhibitor
Name:
BDBM96565
Synonyms:
MLS000097997 N-(3,4-dihydro-1H-isoquinolin-2-ylmethyl)pyrazinamide SMR000060646 | cid_1277315
Type:
Small organic molecule
Emp. Form.:
C15H16N4O
Mol. Mass.:
268.3137
SMILES:
O=C(NCN1CCc2ccccc2C1)c1cnccn1
: