Target
Guanine nucleotide-binding protein subunit alpha-15
Ligand
BDBM96756
Substrate
EC50
>29905±n/a nM
Citation
 PubChem, PC Counterscreen for agonists of the human trace amine associated receptor 1 (TAAR1): Fluorescence-based cell-based high throughput dose response assay to identify nonselective Ga16 agonists PubChem Bioassay (2013)[AID] 
Target
Name:
Guanine nucleotide-binding protein subunit alpha-15
Synonyms:
G-protein subunit alpha-16 GNA15 GNA16 | guanine nucleotide-binding protein subunit alpha-15
Type:
Protein
Mol. Mass.:
43577.62
Organism:
Homo sapiens (Human)
Description:
P30679
Residue:
374
  
Inhibitor
Name:
BDBM96756
Synonyms:
2-(4-Nitro-imidazol-1-yl)-N-phenethyl-acetamide 2-(4-nitroimidazol-1-yl)-N-(2-phenylethyl)acetamide 2-(4-nitroimidazol-1-yl)-N-phenethyl-acetamide SMR000513800 | cid_1099826
Type:
Small organic molecule
Emp. Form.:
C13H14N4O3
Mol. Mass.:
274.2753
SMILES:
[O-][N+](=O)c1cn(CC(=O)NCCc2ccccc2)cn1
: