Target
Guanine nucleotide-binding protein subunit alpha-15
Ligand
BDBM96788
Substrate
EC50
>29910±n/a nM
Citation
 PubChem, PC Counterscreen for agonists of the human trace amine associated receptor 1 (TAAR1): Fluorescence-based cell-based high throughput dose response assay to identify nonselective Ga16 agonists PubChem Bioassay (2013)[AID] 
Target
Name:
Guanine nucleotide-binding protein subunit alpha-15
Synonyms:
G-protein subunit alpha-16 GNA15 GNA16 | guanine nucleotide-binding protein subunit alpha-15
Type:
Protein
Mol. Mass.:
43577.62
Organism:
Homo sapiens (Human)
Description:
P30679
Residue:
374
  
Inhibitor
Name:
BDBM96788
Synonyms:
3-[(3-keto-6-methyl-4H-1,4-benzoxazin-7-yl)sulfonyl]-N-phenethyl-propionamide 3-[(6-methyl-3-oxo-4H-1,4-benzoxazin-7-yl)sulfonyl]-N-(2-phenylethyl)propanamide SMR000627456 | cid_16018447
Type:
Small organic molecule
Emp. Form.:
C20H22N2O5S
Mol. Mass.:
402.464
SMILES:
Cc1cc2NC(=O)COc2cc1S(=O)(=O)CCC(=O)NCCc1ccccc1
: