Target
Trace amine-associated receptor 1
Ligand
BDBM96671
Substrate
EC50
336.53±n/a nM
Citation
 PubChem, PC Fluorescence-based cell-based high throughput dose response assay to identify agonists of the human trace amine associated receptor 1 (TAAR1) PubChem Bioassay (2013)[AID] 
Target
Name:
Trace amine-associated receptor 1
Synonyms:
TA1 TAAR1_HUMAN TRAR1 | trace amine-associated receptor 1
Type:
PROTEIN
Mol. Mass.:
39107.47
Organism:
Homo sapiens (Human)
Description:
ChEMBL_792734
Residue:
339
  
Inhibitor
Name:
BDBM96671
Synonyms:
(2-ethoxy-5-nitro-benzyl)-phenethyl-amine;hydrochloride N-(2-ethoxy-5-nitrobenzyl)-2-phenylethanamine hydrochloride N-[(2-ethoxy-5-nitrophenyl)methyl]-2-phenylethanamine;hydrochloride cid_2959881
Type:
Small organic molecule
Emp. Form.:
C17H20N2O3
Mol. Mass.:
300.3523
SMILES:
CCOc1ccc(cc1CNCCc1ccccc1)[N+]([O-])=O
: