Target
Trace amine-associated receptor 1
Ligand
BDBM76862
Substrate
EC50
>9970±n/a nM
Citation
 PubChem, PC Fluorescence-based cell-based high throughput dose response assay to identify agonists of the human trace amine associated receptor 1 (TAAR1) PubChem Bioassay (2013)[AID] 
Target
Name:
Trace amine-associated receptor 1
Synonyms:
TA1 TAAR1_HUMAN TRAR1 | trace amine-associated receptor 1
Type:
PROTEIN
Mol. Mass.:
39107.47
Organism:
Homo sapiens (Human)
Description:
ChEMBL_792734
Residue:
339
  
Inhibitor
Name:
BDBM76862
Synonyms:
ANTAZOLINE HYDROCHLORIDE MLS000028599 N-benzyl-N-(4,5-dihydro-1H-imidazol-2-ylmethyl)aniline;hydrochloride benzyl-(2-imidazolin-2-ylmethyl)-phenyl-amine;hydrochloride cid_17275
Type:
Small organic molecule
Emp. Form.:
C17H19N3
Mol. Mass.:
265.3529
SMILES:
C(N(Cc1ccccc1)c1ccccc1)C1=NCCN1
: