Target
Trace amine-associated receptor 1
Ligand
BDBM96814
Substrate
EC50
7372±n/a nM
Citation
 PubChem, PC Fluorescence-based cell-based high throughput dose response assay to identify agonists of the human trace amine associated receptor 1 (TAAR1) PubChem Bioassay (2013)[AID] 
Target
Name:
Trace amine-associated receptor 1
Synonyms:
TA1 TAAR1_HUMAN TRAR1 | trace amine-associated receptor 1
Type:
PROTEIN
Mol. Mass.:
39107.47
Organism:
Homo sapiens (Human)
Description:
ChEMBL_792734
Residue:
339
  
Inhibitor
Name:
BDBM96814
Synonyms:
2-[(2-fluorobenzoyl)amino]acetic acid [2-(1H-indol-3-yl)-2-keto-ethyl] ester MLS002251504 [2-(1H-indol-3-yl)-2-oxidanylidene-ethyl] 2-[(2-fluorophenyl)carbonylamino]ethanoate cid_2602001
Type:
Small organic molecule
Emp. Form.:
C19H15FN2O4
Mol. Mass.:
354.3318
SMILES:
Fc1ccccc1C(=O)NCC(=O)OCC(=O)c1c[nH]c2ccccc12
: