Target
Trace amine-associated receptor 1
Ligand
BDBM96831
Substrate
EC50
1175±n/a nM
Citation
 PubChem, PC Fluorescence-based cell-based high throughput dose response assay to identify agonists of the human trace amine associated receptor 1 (TAAR1) PubChem Bioassay (2013)[AID] 
Target
Name:
Trace amine-associated receptor 1
Synonyms:
TA1 TAAR1_HUMAN TRAR1 | trace amine-associated receptor 1
Type:
PROTEIN
Mol. Mass.:
39107.47
Organism:
Homo sapiens (Human)
Description:
ChEMBL_792734
Residue:
339
  
Inhibitor
Name:
BDBM96831
Synonyms:
4-(1-aminoethyl)-N-(6-methoxy-2-pyridinyl)-2-thiazolamine 4-(1-azanylethyl)-N-(6-methoxypyridin-2-yl)-1,3-thiazol-2-amine SMR001291787 cid_46942876
Type:
Small organic molecule
Emp. Form.:
C11H14N4OS
Mol. Mass.:
250.32
SMILES:
COc1cccc(Nc2nc(cs2)C(C)N)n1
: