Target
Trace amine-associated receptor 1
Ligand
BDBM96927
Substrate
EC50
>29906±n/a nM
Citation
 PubChem, PC Counterscreen for antagonists of the human trace amine associated receptor 1 (hTAAR1): Fluorescence-based cell-based high throughput dose response assay to identify TAAR1 Agonists PubChem Bioassay (2013)[AID] 
Target
Name:
Trace amine-associated receptor 1
Synonyms:
TA1 TAAR1_HUMAN TRAR1 | trace amine-associated receptor 1
Type:
PROTEIN
Mol. Mass.:
39107.47
Organism:
Homo sapiens (Human)
Description:
ChEMBL_792734
Residue:
339
  
Inhibitor
Name:
BDBM96927
Synonyms:
6-fluoranyl-4-(4-nitrophenyl)-3-phenyl-isoquinoline 6-fluoro-4-(4-nitrophenyl)-3-phenylisoquinoline SMR001355708 | cid_44142561
Type:
Small organic molecule
Emp. Form.:
C21H13FN2O2
Mol. Mass.:
344.3385
SMILES:
[O-][N+](=O)c1ccc(cc1)-c1c(ncc2ccc(F)cc12)-c1ccccc1
: