Target
Guanine nucleotide-binding protein subunit alpha-15
Ligand
BDBM96896
Substrate
IC50
>29909±n/a nM
Citation
 PubChem, PC Counterscreen for antagonists of the human trace amine associated receptor 1 (hTAAR1): Fluorescence-based cell-based high throughput dose response assay to identify nonselective Ga16 antagonists PubChem Bioassay (2013)[AID] 
Target
Name:
Guanine nucleotide-binding protein subunit alpha-15
Synonyms:
G-protein subunit alpha-16 GNA15 GNA16 | guanine nucleotide-binding protein subunit alpha-15
Type:
Protein
Mol. Mass.:
43577.62
Organism:
Homo sapiens (Human)
Description:
P30679
Residue:
374
  
Inhibitor
Name:
BDBM96896
Synonyms:
5-(4-methoxyphenyl)-N-(2-methylpropyl)-1,2-oxazole-3-carboxamide MLS000087048 SMR000023271 | cid_3240709
Type:
Small organic molecule
Emp. Form.:
C15H18N2O3
Mol. Mass.:
274.315
SMILES:
COc1ccc(cc1)-c1cc(no1)C(=O)NCC(C)C
: