Target
Guanine nucleotide-binding protein subunit alpha-15
Ligand
BDBM96921
Substrate
IC50
>29902±n/a nM
Citation
 PubChem, PC Counterscreen for antagonists of the human trace amine associated receptor 1 (hTAAR1): Fluorescence-based cell-based high throughput dose response assay to identify nonselective Ga16 antagonists PubChem Bioassay (2013)[AID] 
Target
Name:
Guanine nucleotide-binding protein subunit alpha-15
Synonyms:
G-protein subunit alpha-16 GNA15 GNA16 | guanine nucleotide-binding protein subunit alpha-15
Type:
Protein
Mol. Mass.:
43577.62
Organism:
Homo sapiens (Human)
Description:
P30679
Residue:
374
  
Inhibitor
Name:
BDBM96921
Synonyms:
2-(4-methoxyphenyl)-5-(6-methoxy-3-pyridinyl)-3-benzofurancarboxylic acid propyl ester MLS001249932 cid_24818794 propyl 2-(4-methoxyphenyl)-5-(6-methoxypyridin-3-yl)benzofuran-3-carboxylate
Type:
Small organic molecule
Emp. Form.:
C25H23NO5
Mol. Mass.:
417.4538
SMILES:
CCCOC(=O)c1c(oc2ccc(cc12)-c1ccc(OC)nc1)-c1ccc(OC)cc1
: