Target
Guanine nucleotide-binding protein subunit alpha-15
Ligand
BDBM66994
Substrate
IC50
>29910±n/a nM
Citation
 PubChem, PC Counterscreen for antagonists of the human trace amine associated receptor 1 (hTAAR1): Fluorescence-based cell-based high throughput dose response assay to identify nonselective Ga16 antagonists PubChem Bioassay (2013)[AID] 
Target
Name:
Guanine nucleotide-binding protein subunit alpha-15
Synonyms:
G-protein subunit alpha-16 GNA15 GNA16 | guanine nucleotide-binding protein subunit alpha-15
Type:
Protein
Mol. Mass.:
43577.62
Organism:
Homo sapiens (Human)
Description:
P30679
Residue:
374
  
Inhibitor
Name:
BDBM66994
Synonyms:
4-[(2,6-dibromo-4-methyl-phenoxy)methyl]-N'-[(Z)-pyrrol-2-ylidenemethyl]benzohydrazide 4-[(2,6-dibromo-4-methylphenoxy)methyl]-N'-[(Z)-pyrrol-2-ylidenemethyl]benzohydrazide MLS002161081 cid_6508428
Type:
Small organic molecule
Emp. Form.:
C20H17Br2N3O2
Mol. Mass.:
491.176
SMILES:
Cc1cc(Br)c(OCc2ccc(cc2)C(=O)NN=Cc2ccc[nH]2)c(Br)c1
: