Target
Guanine nucleotide-binding protein subunit alpha-15
Ligand
BDBM96622
Substrate
IC50
>29859±n/a nM
Citation
 PubChem, PC Counterscreen for agonists of the human trace amine associated receptor 1 (TAAR1): Fluorescence-based cell-based high throughput dose response assay to identify nonselective Ga16 antagonists PubChem Bioassay (2013)[AID] 
Target
Name:
Guanine nucleotide-binding protein subunit alpha-15
Synonyms:
G-protein subunit alpha-16 GNA15 GNA16 | guanine nucleotide-binding protein subunit alpha-15
Type:
Protein
Mol. Mass.:
43577.62
Organism:
Homo sapiens (Human)
Description:
P30679
Residue:
374
  
Inhibitor
Name:
BDBM96622
Synonyms:
5-chloranyl-4-[(2Z)-2-[(3-methylphenyl)methylidene]hydrazinyl]-1H-pyridazin-6-one 5-chloro-4-[(N'Z)-N'-(3-methylbenzylidene)hydrazino]-1H-pyridazin-6-one SMR000131814 | cid_5781448
Type:
Small organic molecule
Emp. Form.:
C12H11ClN4O
Mol. Mass.:
262.695
SMILES:
Cc1cccc(CN=Nc2cn[nH]c(=O)c2Cl)c1
: