Target
Guanine nucleotide-binding protein subunit alpha-15
Ligand
BDBM96898
Substrate
EC50
>29916±n/a nM
Citation
 PubChem, PC Counterscreen for antagonists of the human trace amine associated receptor 1 (TAAR1): Fluorescence-based cell-based high throughput dose reponse assay to identify nonselective Ga16 agonists PubChem Bioassay (2013)[AID] 
Target
Name:
Guanine nucleotide-binding protein subunit alpha-15
Synonyms:
G-protein subunit alpha-16 GNA15 GNA16 | guanine nucleotide-binding protein subunit alpha-15
Type:
Protein
Mol. Mass.:
43577.62
Organism:
Homo sapiens (Human)
Description:
P30679
Residue:
374
  
Inhibitor
Name:
BDBM96898
Synonyms:
3-(1,3-dioxo-1,3,3a,4,7,7a-hexahydro-2H-4,7-methanoisoindol-2-yl)-N-(2-phenylethyl)propanamide SMR000033523 | cid_3243722
Type:
Small organic molecule
Emp. Form.:
C20H22N2O3
Mol. Mass.:
338.4003
SMILES:
[H]C12CC([H])(C=C1)C1C2C(=O)N(CCC(=O)NCCc2ccccc2)C1=O
: