Target
Guanine nucleotide-binding protein subunit alpha-15
Ligand
BDBM96899
Substrate
EC50
>29913±n/a nM
Citation
 PubChem, PC Counterscreen for antagonists of the human trace amine associated receptor 1 (TAAR1): Fluorescence-based cell-based high throughput dose reponse assay to identify nonselective Ga16 agonists PubChem Bioassay (2013)[AID] 
Target
Name:
Guanine nucleotide-binding protein subunit alpha-15
Synonyms:
G-protein subunit alpha-16 GNA15 GNA16 | guanine nucleotide-binding protein subunit alpha-15
Type:
Protein
Mol. Mass.:
43577.62
Organism:
Homo sapiens (Human)
Description:
P30679
Residue:
374
  
Inhibitor
Name:
BDBM96899
Synonyms:
3'-methyl-2'-spiro[1,3-dithiolane-2,4'-6,7-dihydro-5H-benzofuran]carboxylic acid methyl ester MLS000066906 cid_1248737 methyl 3-methyl-6,7-dihydro-5H-spiro[1-benzofuran-4,2'-[1,3]dithiolane]-2-carboxylate
Type:
Small organic molecule
Emp. Form.:
C13H16O3S2
Mol. Mass.:
284.394
SMILES:
COC(=O)c1oc2CCCC3(SCCS3)c2c1C
: