Target
Guanine nucleotide-binding protein subunit alpha-15
Ligand
BDBM57007
Substrate
EC50
>29910±n/a nM
Citation
 PubChem, PC Counterscreen for antagonists of the human trace amine associated receptor 1 (TAAR1): Fluorescence-based cell-based high throughput dose reponse assay to identify nonselective Ga16 agonists PubChem Bioassay (2013)[AID] 
Target
Name:
Guanine nucleotide-binding protein subunit alpha-15
Synonyms:
G-protein subunit alpha-16 GNA15 GNA16 | guanine nucleotide-binding protein subunit alpha-15
Type:
Protein
Mol. Mass.:
43577.62
Organism:
Homo sapiens (Human)
Description:
P30679
Residue:
374
  
Inhibitor
Name:
BDBM57007
Synonyms:
3-(3-methoxyphenyl)-1-phenyl-N-(1,3-thiazol-2-yl)pyrazole-4-carboxamide 3-(3-methoxyphenyl)-1-phenyl-N-1,3-thiazol-2-yl-1H-pyrazole-4-carboxamide MLS000097082 cid_2201062
Type:
Small organic molecule
Emp. Form.:
C20H16N4O2S
Mol. Mass.:
376.432
SMILES:
COc1cccc(c1)-c1nn(cc1C(=O)Nc1nccs1)-c1ccccc1
: