Target
Guanine nucleotide-binding protein subunit alpha-15
Ligand
BDBM96902
Substrate
EC50
>29913±n/a nM
Citation
 PubChem, PC Counterscreen for antagonists of the human trace amine associated receptor 1 (TAAR1): Fluorescence-based cell-based high throughput dose reponse assay to identify nonselective Ga16 agonists PubChem Bioassay (2013)[AID] 
Target
Name:
Guanine nucleotide-binding protein subunit alpha-15
Synonyms:
G-protein subunit alpha-16 GNA15 GNA16 | guanine nucleotide-binding protein subunit alpha-15
Type:
Protein
Mol. Mass.:
43577.62
Organism:
Homo sapiens (Human)
Description:
P30679
Residue:
374
  
Inhibitor
Name:
BDBM96902
Synonyms:
(E)-2-Cyano-3-[1-(2-fluoro-phenyl)-2,5-dimethyl-1H-pyrrol-3-yl]-N-thiophen-2-ylmethyl-acrylamide (E)-2-cyano-3-[1-(2-fluorophenyl)-2,5-dimethyl-pyrrol-3-yl]-N-(2-thenyl)acrylamide (E)-2-cyano-3-[1-(2-fluorophenyl)-2,5-dimethylpyrrol-3-yl]-N-(thiophen-2-ylmethyl)prop-2-enamide SMR000147552 | cid_1405179
Type:
Small organic molecule
Emp. Form.:
C21H18FN3OS
Mol. Mass.:
379.451
SMILES:
Cc1cc(\C=C(/C#N)C(=O)NCc2cccs2)c(C)n1-c1ccccc1F
: