Target
Probable global transcription activator SNF2L2
Ligand
BDBM96931
Substrate
EC50
91076±n/a nM
Citation
 PubChem, PC Luminescence-based cell-based high throughput dose response assay to identify activators of the function of SWI/SNF related, matrix associated, actin dependent regulator of chromatin, subfamily a, member 2 (SMARCA2, BRM) PubChem Bioassay (2013)[AID] 
Target
Name:
Probable global transcription activator SNF2L2
Synonyms:
ATP-dependent helicase SMARCA2 BRG1-associated factor 190B Protein brahma homolog SMCA2_HUMAN SNF2A SWI/SNF-related matrix-associated actin-dependent regulator of chromatin subfamily A member 2 | hBRM
Type:
Enzyme Catalytic Domain
Mol. Mass.:
181290.91
Organism:
Homo sapiens (Human)
Description:
P51531
Residue:
1590
  
Inhibitor
Name:
BDBM96931
Synonyms:
MLS000031270 N,N-diethyl-2-[[5-(3-methoxyphenyl)-1,3,4-oxadiazol-2-yl]sulfanyl]acetamide N,N-diethyl-2-[[5-(3-methoxyphenyl)-1,3,4-oxadiazol-2-yl]thio]acetamide cid_645909
Type:
Small organic molecule
Emp. Form.:
C15H19N3O3S
Mol. Mass.:
321.395
SMILES:
CCN(CC)C(=O)CSc1nnc(o1)-c1cccc(OC)c1
: