Target
Probable global transcription activator SNF2L2
Ligand
BDBM96941
Substrate
EC50
91153±n/a nM
Citation
 PubChem, PC Luminescence-based cell-based high throughput dose response assay to identify activators of the function of SWI/SNF related, matrix associated, actin dependent regulator of chromatin, subfamily a, member 2 (SMARCA2, BRM) PubChem Bioassay (2013)[AID] 
Target
Name:
Probable global transcription activator SNF2L2
Synonyms:
ATP-dependent helicase SMARCA2 BRG1-associated factor 190B Protein brahma homolog SMCA2_HUMAN SNF2A SWI/SNF-related matrix-associated actin-dependent regulator of chromatin subfamily A member 2 | hBRM
Type:
Enzyme Catalytic Domain
Mol. Mass.:
181290.91
Organism:
Homo sapiens (Human)
Description:
P51531
Residue:
1590
  
Inhibitor
Name:
BDBM96941
Synonyms:
4-[5-(4-methoxyphenyl)-1,3,4-oxadiazol-2-yl]-N,N-dimethyl-aniline MLS000061075 [4-[5-(4-methoxyphenyl)-1,3,4-oxadiazol-2-yl]phenyl]-dimethyl-amine | cid_743142
Type:
Small organic molecule
Emp. Form.:
C17H17N3O2
Mol. Mass.:
295.3358
SMILES:
COc1ccc(cc1)-c1nnc(o1)-c1ccc(cc1)N(C)C
: