Target
Probable global transcription activator SNF2L2
Ligand
BDBM65582
Substrate
EC50
91115±n/a nM
Citation
 PubChem, PC Luminescence-based cell-based high throughput dose response assay to identify activators of the function of SWI/SNF related, matrix associated, actin dependent regulator of chromatin, subfamily a, member 2 (SMARCA2, BRM) PubChem Bioassay (2013)[AID] 
Target
Name:
Probable global transcription activator SNF2L2
Synonyms:
ATP-dependent helicase SMARCA2 BRG1-associated factor 190B Protein brahma homolog SMCA2_HUMAN SNF2A SWI/SNF-related matrix-associated actin-dependent regulator of chromatin subfamily A member 2 | hBRM
Type:
Enzyme Catalytic Domain
Mol. Mass.:
181290.91
Organism:
Homo sapiens (Human)
Description:
P51531
Residue:
1590
  
Inhibitor
Name:
BDBM65582
Synonyms:
5-Nitro-furan-2-carboxylic acid (4-methoxy-phenyl)-amide N-(4-methoxyphenyl)-5-nitro-2-furamide N-(4-methoxyphenyl)-5-nitro-furan-2-carboxamide SMR000513391 | cid_774010
Type:
Small organic molecule
Emp. Form.:
C12H10N2O5
Mol. Mass.:
262.2182
SMILES:
COc1ccc(NC(=O)c2ccc(o2)[N+]([O-])=O)cc1
: