Target
Probable global transcription activator SNF2L2
Ligand
BDBM64769
Substrate
EC50
91143±n/a nM
Citation
 PubChem, PC Luminescence-based cell-based high throughput dose response assay to identify activators of the function of SWI/SNF related, matrix associated, actin dependent regulator of chromatin, subfamily a, member 2 (SMARCA2, BRM) PubChem Bioassay (2013)[AID] 
Target
Name:
Probable global transcription activator SNF2L2
Synonyms:
ATP-dependent helicase SMARCA2 BRG1-associated factor 190B Protein brahma homolog SMCA2_HUMAN SNF2A SWI/SNF-related matrix-associated actin-dependent regulator of chromatin subfamily A member 2 | hBRM
Type:
Enzyme Catalytic Domain
Mol. Mass.:
181290.91
Organism:
Homo sapiens (Human)
Description:
P51531
Residue:
1590
  
Inhibitor
Name:
BDBM64769
Synonyms:
MLS001232886 N-(5-acetyl-4-methyl-2-thiazolyl)-3-(benzenesulfonyl)propanamide N-(5-ethanoyl-4-methyl-1,3-thiazol-2-yl)-3-(phenylsulfonyl)propanamide cid_7189652
Type:
Small organic molecule
Emp. Form.:
C15H16N2O4S2
Mol. Mass.:
352.429
SMILES:
CC(=O)c1sc(NC(=O)CCS(=O)(=O)c2ccccc2)nc1C
: