Target
Probable global transcription activator SNF2L2
Ligand
BDBM83852
Substrate
EC50
3383±n/a nM
Citation
 PubChem, PC Luminescence-based cell-based high throughput dose response assay to identify activators of the function of SWI/SNF related, matrix associated, actin dependent regulator of chromatin, subfamily a, member 2 (SMARCA2, BRM) PubChem Bioassay (2013)[AID] 
Target
Name:
Probable global transcription activator SNF2L2
Synonyms:
ATP-dependent helicase SMARCA2 BRG1-associated factor 190B Protein brahma homolog SMCA2_HUMAN SNF2A SWI/SNF-related matrix-associated actin-dependent regulator of chromatin subfamily A member 2 | hBRM
Type:
Enzyme Catalytic Domain
Mol. Mass.:
181290.91
Organism:
Homo sapiens (Human)
Description:
P51531
Residue:
1590
  
Inhibitor
Name:
BDBM83852
Synonyms:
2,3-dihydroimidazo[1,2-f]phenanthridine MLS002920530 cid_285026
Type:
Small organic molecule
Emp. Form.:
C15H12N2
Mol. Mass.:
220.2692
SMILES:
C1CN2C(=N1)c1ccccc1-c1ccccc21
: