Target
Trace amine-associated receptor 1
Ligand
BDBM96916
Substrate
IC50
10543±n/a nM
Citation
 PubChem, PC Fluorescence-based cell-based high throughput dose response assay to identify antagonists of the human trace amine associated receptor 1 (TAAR1) PubChem Bioassay (2013)[AID] 
Target
Name:
Trace amine-associated receptor 1
Synonyms:
TA1 TAAR1_HUMAN TRAR1 | trace amine-associated receptor 1
Type:
PROTEIN
Mol. Mass.:
39107.47
Organism:
Homo sapiens (Human)
Description:
ChEMBL_792734
Residue:
339
  
Inhibitor
Name:
BDBM96916
Synonyms:
MLS001000420 N-benzhydryl-3-(2-ethoxyethoxy)benzamide cid_2982577
Type:
Small organic molecule
Emp. Form.:
C24H25NO3
Mol. Mass.:
375.4602
SMILES:
CCOCCOc1cccc(c1)C(=O)NC(c1ccccc1)c1ccccc1
: