Target
Galanin receptor type 3
Ligand
BDBM97079
Substrate
IC50
367.22±n/a nM
Citation
 PubChem, PC Fluorescence-based cell-based primary high throughput dose response assay to identify antagonists of the Galanin Receptor 3 (GalR3). PubChem Bioassay (2013)[AID] 
Target
Name:
Galanin receptor type 3
Synonyms:
GALNR3 GALR3_HUMAN Galanin receptor 3 | Galanin receptor type 3
Type:
Enzyme Catalytic Domain
Mol. Mass.:
39599.97
Organism:
Homo sapiens (Human)
Description:
Galanin R3 GALR3 HUMAN::O60755
Residue:
368
  
Inhibitor
Name:
BDBM97079
Synonyms:
3-[4-(2-hydroxyethylamino)-3-nitro-phenyl]-4-methyl-4,5-dihydro-1H-pyridazin-6-one 6-{4-[(2-hydroxyethyl)amino]-3-nitrophenyl}-5-methyl-4,5-dihydro-3(2H)-pyridazinone SMR000193514 | cid_3695590
Type:
Small organic molecule
Emp. Form.:
C13H16N4O4
Mol. Mass.:
292.2905
SMILES:
CC1CC(=O)N[N-][C+]1c1ccc(NCCO)c(c1)[N+]([O-])=O
: