Target
Galanin receptor type 3
Ligand
BDBM89372
Substrate
IC50
140.16±n/a nM
Citation
 PubChem, PC Fluorescence-based cell-based primary high throughput dose response assay to identify antagonists of the Galanin Receptor 3 (GalR3). PubChem Bioassay (2013)[AID] 
Target
Name:
Galanin receptor type 3
Synonyms:
GALNR3 GALR3_HUMAN Galanin receptor 3 | Galanin receptor type 3
Type:
Enzyme Catalytic Domain
Mol. Mass.:
39599.97
Organism:
Homo sapiens (Human)
Description:
Galanin R3 GALR3 HUMAN::O60755
Residue:
368
  
Inhibitor
Name:
BDBM89372
Synonyms:
1-(4-bromobenzyl)-2-methyl-1H-benzimidazole 1-[(4-bromophenyl)methyl]-2-methyl-benzimidazole MLS001077238 cid_743662
Type:
Small organic molecule
Emp. Form.:
C15H13BrN2
Mol. Mass.:
301.181
SMILES:
Cc1nc2ccccc2n1Cc1ccc(Br)cc1
: