Target
Galanin receptor type 3
Ligand
BDBM42438
Substrate
IC50
403.97±n/a nM
Citation
 PubChem, PC Fluorescence-based cell-based primary high throughput dose response assay to identify antagonists of the Galanin Receptor 3 (GalR3). PubChem Bioassay (2013)[AID] 
Target
Name:
Galanin receptor type 3
Synonyms:
GALNR3 GALR3_HUMAN Galanin receptor 3 | Galanin receptor type 3
Type:
Enzyme Catalytic Domain
Mol. Mass.:
39599.97
Organism:
Homo sapiens (Human)
Description:
Galanin R3 GALR3 HUMAN::O60755
Residue:
368
  
Inhibitor
Name:
BDBM42438
Synonyms:
(2Z)-3-ethyl-2-[[3-methyl-5-(2-methylphenyl)-1,3-thiazol-3-ium-2-yl]methylidene]-1,3-benzothiazole;iodide (2Z)-3-ethyl-2-[[3-methyl-5-(o-tolyl)thiazol-3-ium-2-yl]methylene]-1,3-benzothiazole;iodide MLS000727848 cid_16188793
Type:
Small organic molecule
Emp. Form.:
C21H21N2S2
Mol. Mass.:
365.534
SMILES:
CCN1\C(Sc2ccccc12)=C\c1sc(c[n+]1C)-c1ccccc1C
: