Target
Nuclear receptor subfamily 0 group B member 1
Ligand
BDBM76397
Substrate
IC50
>92.6±n/a nM
Citation
 PubChem, PC Luminescence-based cell-based high throughput dose response assay for inhibitors of the orphan nuclear receptor subfamily 0, group B, member 1 (DAX1; NR0B1): repression of SF-1 (NR5A1) activated StAR promoter by full-length DAX-1 PubChem Bioassay (2013)[AID] 
Target
Name:
Nuclear receptor subfamily 0 group B member 1
Synonyms:
AHC NR0B1 | NR0B1_HUMAN
Type:
Enzyme Catalytic Domain
Mol. Mass.:
51729.22
Organism:
Homo sapiens (Human)
Description:
gi_5016090
Residue:
470
  
Inhibitor
Name:
BDBM76397
Synonyms:
(7-Methyl-2-thioxo-2H-[1,2,4]triazolo[1,5-a]pyridin-3-yl)-phenyl-methanone (7-methyl-2-sulfanylidene-[1,2,4]triazolo[1,5-a]pyridin-3-yl)-phenylmethanone MLS000554168 cid_921913
Type:
Small organic molecule
Emp. Form.:
C14H11N3OS
Mol. Mass.:
269.322
SMILES:
Cc1ccn2n(C(=O)c3ccccc3)c(=S)nc2c1
: