Target
Nuclear receptor subfamily 0 group B member 1
Ligand
BDBM97307
Substrate
IC50
134.26±n/a nM
Citation
 PubChem, PC Luminescence-based cell-based high throughput dose response assay for inhibitors of the orphan nuclear receptor subfamily 0, group B, member 1 (DAX1; NR0B1): repression of SF-1 (NR5A1) activated StAR promoter by full-length DAX-1 PubChem Bioassay (2013)[AID] 
Target
Name:
Nuclear receptor subfamily 0 group B member 1
Synonyms:
AHC NR0B1 | NR0B1_HUMAN
Type:
Enzyme Catalytic Domain
Mol. Mass.:
51729.22
Organism:
Homo sapiens (Human)
Description:
gi_5016090
Residue:
470
  
Inhibitor
Name:
BDBM97307
Synonyms:
(1S,2E,7S,10E,12R,13R,15S)-12,15-dihydroxy-7-methyl-8-oxabicyclo[11.3.0]hexadeca-2,10-dien-9-one Ascotoxin MLS001074108 cid_5287620
Type:
Small organic molecule
Emp. Form.:
C16H24O4
Mol. Mass.:
280.3594
SMILES:
C[C@H]1CCC\C=C\[C@@H]2C[C@H](O)C[C@H]2[C@H](O)\C=C\C(=O)O1
: