Target
Steroidogenic factor 1
Ligand
BDBM48188
Substrate
IC50
>67518±n/a nM
Citation
 PubChem, PC Counterscreen for inhibitors of the orphan nuclear receptor subfamily 0, group B, member 1 (DAX1; NR0B1): Luminescence-based cell-based high throughput dose response assay for nonselective inhibitors/assay artifacts using AP2 mutant SF-1 (NR5A1) Transactivation Assay PubChem Bioassay (2013)[AID] 
Target
Name:
Steroidogenic factor 1
Synonyms:
AD4BP FTZF1 NR5A1 SF-1 STF-1 Steroid hormone receptor Ad4BP
Type:
Nuclear Hormone Receptor
Mol. Mass.:
51643.43
Organism:
Homo sapiens (Human)
Description:
Residue:
461
  
Inhibitor
Name:
BDBM48188
Synonyms:
(Z)-1-phenyl-3-(2-pyridinylamino)-2-propen-1-one (Z)-1-phenyl-3-(pyridin-2-ylamino)prop-2-en-1-one SMR000105330 | cid_5310821
Type:
Small organic molecule
Emp. Form.:
C14H12N2O
Mol. Mass.:
224.2579
SMILES:
O=C(CC=Nc1ccccn1)c1ccccc1
: