Target
Steroidogenic factor 1
Ligand
BDBM50116318
Substrate
IC50
>67485±n/a nM
Citation
 PubChem, PC Counterscreen for inhibitors of the orphan nuclear receptor subfamily 0, group B, member 1 (DAX1; NR0B1): Luminescence-based cell-based high throughput dose response assay for nonselective inhibitors/assay artifacts using AP2 mutant SF-1 (NR5A1) Transactivation Assay PubChem Bioassay (2013)[AID] 
Target
Name:
Steroidogenic factor 1
Synonyms:
AD4BP FTZF1 NR5A1 SF-1 STF-1 Steroid hormone receptor Ad4BP
Type:
Nuclear Hormone Receptor
Mol. Mass.:
51643.43
Organism:
Homo sapiens (Human)
Description:
Residue:
461
  
Inhibitor
Name:
BDBM50116318
Synonyms:
(1-Phenyl-ethyl)-(2-phenyl-quinazolin-4-yl)-amine cid_5051334
Type:
Small organic molecule
Emp. Form.:
C22H19N3
Mol. Mass.:
325.4064
SMILES:
C[C@H](Nc1nc(nc2ccccc12)-c1ccccc1)c1ccccc1
: