Target
Steroidogenic factor 1
Ligand
BDBM96066
Substrate
IC50
>67516±n/a nM
Citation
 PubChem, PC Counterscreen for inhibitors of the orphan nuclear receptor subfamily 0, group B, member 1 (DAX1; NR0B1): Luminescence-based cell-based high throughput dose response assay for nonselective inhibitors/assay artifacts using AP2 mutant SF-1 (NR5A1) Transactivation Assay PubChem Bioassay (2013)[AID] 
Target
Name:
Steroidogenic factor 1
Synonyms:
AD4BP FTZF1 NR5A1 SF-1 STF-1 Steroid hormone receptor Ad4BP
Type:
Nuclear Hormone Receptor
Mol. Mass.:
51643.43
Organism:
Homo sapiens (Human)
Description:
Residue:
461
  
Inhibitor
Name:
BDBM96066
Synonyms:
1,3-benzothiazol-2-yl-(cycloheptylideneamino)amine N-(cycloheptylideneamino)-1,3-benzothiazol-2-amine cid_3799256
Type:
Small organic molecule
Emp. Form.:
C14H17N3S
Mol. Mass.:
259.37
SMILES:
[#6]-1-[#6]-[#6]-[#6]\[#6](-[#6]-[#6]-1)=[#7]/[#7]-c1nc2ccccc2s1
: