Target
Steroidogenic factor 1
Ligand
BDBM97329
Substrate
IC50
>67499±n/a nM
Citation
 PubChem, PC Counterscreen for inhibitors of the orphan nuclear receptor subfamily 0, group B, member 1 (DAX1; NR0B1): Luminescence-based cell-based high throughput dose response assay for nonselective inhibitors/assay artifacts using AP2 mutant SF-1 (NR5A1) Transactivation Assay PubChem Bioassay (2013)[AID] 
Target
Name:
Steroidogenic factor 1
Synonyms:
AD4BP FTZF1 NR5A1 SF-1 STF-1 Steroid hormone receptor Ad4BP
Type:
Nuclear Hormone Receptor
Mol. Mass.:
51643.43
Organism:
Homo sapiens (Human)
Description:
Residue:
461
  
Inhibitor
Name:
BDBM97329
Synonyms:
4-[4-(4-nitrobenzyl)oxybenzyl]morpholine MLS002699557 cid_45280883
Type:
Small organic molecule
Emp. Form.:
C18H20N2O4
Mol. Mass.:
328.3624
SMILES:
[O-][N+](=O)c1ccc(COc2ccc(CN3CCOCC3)cc2)cc1
: