Target
Activated CDC42 kinase 1
Ligand
BDBM98260
Substrate
Meas. Tech.
AlphaScreen Assay
IC50
75±n/a nM
Citation
 Crew, APJin, MKadalbajoo, MKleinberg, AMulvihill, MJWang, J Substituted imidazopyr- and imidazotri-azines US Patent  US8481733 Publication Date 7/9/2013 
Target
Name:
Activated CDC42 kinase 1
Synonyms:
ACK1 Activated CDC42 kinase 1 (ACK-1) Tyrosine kinase non-receptor protein 2
Type:
Protein
Mol. Mass.:
114577.86
Organism:
Homo sapiens (Human)
Description:
Q07912
Residue:
1038
  
Inhibitor
Name:
BDBM98260
Synonyms:
US8481733, 72
Type:
Small organic molecule
Emp. Form.:
C23H22N4O2
Mol. Mass.:
386.4464
SMILES:
COc1cc(Oc2ccccc2)ccc1-c1nc(C2CCC2)n2ccnc(N)c12
: