Target
Kallikrein-7
Ligand
BDBM100108
Substrate
EC50
>69467±n/a nM
Citation
 PubChem, PC Fluorescence Intensity-based biochemical primary high throughput dose response assay to identify activators of kallikrein-7 (K7) zymogen PubChem Bioassay (2013)[AID] 
Target
Name:
Kallikrein-7
Synonyms:
KLK7 Kallikrein 7 PRSS6 Serine protease 6 hK7 kallikrein-7 isoform 1 preproprotein
Type:
PROTEIN
Mol. Mass.:
27535.05
Organism:
Homo sapiens (Human)
Description:
ChEMBL_1469257
Residue:
253
  
Inhibitor
Name:
BDBM100108
Synonyms:
MLS001210971 N-[4-(6-acetamido-1,3-benzoxazol-2-yl)phenyl]acetamide SMR000514032 | cid_831341
Type:
Small organic molecule
Emp. Form.:
C17H15N3O3
Mol. Mass.:
309.3193
SMILES:
CC(=O)Nc1ccc(cc1)-c1nc2ccc(NC(C)=O)cc2o1
: