Target
Kallikrein-7
Ligand
BDBM100115
Substrate
EC50
9547±n/a nM
Citation
 PubChem, PC Fluorescence Intensity-based biochemical primary high throughput dose response assay to identify activators of kallikrein-7 (K7) zymogen PubChem Bioassay (2013)[AID] 
Target
Name:
Kallikrein-7
Synonyms:
KLK7 Kallikrein 7 PRSS6 Serine protease 6 hK7 kallikrein-7 isoform 1 preproprotein
Type:
PROTEIN
Mol. Mass.:
27535.05
Organism:
Homo sapiens (Human)
Description:
ChEMBL_1469257
Residue:
253
  
Inhibitor
Name:
BDBM100115
Synonyms:
MLS001198754 N-[2-(2,4-dimethoxyphenyl)-4-oxidanylidene-1,2-dihydroquinazolin-3-yl]ethanamide N-[2-(2,4-dimethoxyphenyl)-4-oxo-1,4-dihydroquinazolin-3(2H)-yl]acetamide cid_3542369
Type:
Small organic molecule
Emp. Form.:
C18H19N3O4
Mol. Mass.:
341.3612
SMILES:
COc1ccc(C2Nc3ccccc3C(=O)N2NC(C)=O)c(OC)c1
: