Target
COUP transcription factor 2
Ligand
BDBM97161
Substrate
IC50
616.83±n/a nM
Citation
 PubChem, PC Luminescence-based cell-based high throughput dose response assay to identify inhibitors of COUP-TFII (NR2F2) PubChem Bioassay (2013)[AID] 
Target
Name:
COUP transcription factor 2
Synonyms:
ARP1 COUP transcription factor 2 isoform a TFCOUP2
Type:
Enzyme Catalytic Domain
Mol. Mass.:
45583.83
Organism:
Homo sapiens (Human)
Description:
gi_14149746
Residue:
414
  
Inhibitor
Name:
BDBM97161
Synonyms:
(2Z)-2-[[1-(2-methoxyphenyl)-2,6-dimethyl-4-pyridin-1-iumyl]methylidene]-3-methyl-1,3-benzothiazole;iodide (2Z)-2-[[1-(2-methoxyphenyl)-2,6-dimethyl-pyridin-1-ium-4-yl]methylidene]-3-methyl-1,3-benzothiazole;iodide MLS001332662 cid_16196349
Type:
Small organic molecule
Emp. Form.:
C23H23N2OS
Mol. Mass.:
375.506
SMILES:
COc1ccccc1-[n+]1c(C)cc(\C=C2/Sc3ccccc3N2C)cc1C
: