Target
Monoacylglycerol lipase ABHD2
Ligand
BDBM280644
Substrate
Meas. Tech.
In Vitro Competitive Activity-Based Protein Profiling
IC50
550±n/a nM
Citation
 Cisar, JSGrice, CAJones, TKWeber, ODBuzard, DJShaghafi, MB Spirocycle compounds and methods of making and using same US Patent  US10030020 Publication Date 7/24/2018 
Target
Name:
Monoacylglycerol lipase ABHD2
Synonyms:
2-arachidonoylglycerol hydrolase Abhd2 Labh-2 Lung alpha/beta hydrolase 2 | MmLABH2
Type:
Enzyme Catalytic Domain
Mol. Mass.:
48378.90
Organism:
Mus musculus (Mouse)
Description:
Residue:
425
  
Inhibitor
Name:
BDBM280644
Synonyms:
US10030020, Example 189 | US10781211, Example 189
Type:
Small organic molecule
Emp. Form.:
C26H35ClF6N4O2
Mol. Mass.:
585.025
SMILES:
CN1CCN(CC1)c1c(Cl)cccc1CN1CC2(CC1(C)C)CCN(CC2)C(=O)OC(C(F)(F)F)C(F)(F)F
: