Target
Isoform 3 of Acetyl-CoA carboxylase 2 (ACC2.v2)
Ligand
BDBM101989
Substrate
Meas. Tech.
Enzyme Assay
IC50
9e+1±n/a nM
Citation
 Fleck, MNosse, BHeine, NRoth, GJ Azetidine derivatives US Patent  US8530460 Publication Date 9/10/2013 
Target
Name:
Isoform 3 of Acetyl-CoA carboxylase 2 (ACC2.v2)
Synonyms:
ACACB ACC2 Acetyl-CoA carboxylase 2 (ACC2) | Acetyl-CoA carboxylase 2 (ACC2.v2)
Type:
Protein
Mol. Mass.:
255085.30
Organism:
Homo sapiens (Human)
Description:
AJ575592.3
Residue:
2256
  
Inhibitor
Name:
BDBM101989
Synonyms:
US8530460, 2.6
Type:
Small organic molecule
Emp. Form.:
C22H27ClN2O3
Mol. Mass.:
402.914
SMILES:
CCCOc1ccc(N2CC(C2)Oc2ccc(cc2)[C@H](C)NC(C)=O)c(Cl)c1
: