Target
Activin receptor type-1B
Ligand
BDBM36354
Substrate
IC50
11023±0.0 nM
Citation
 Mohedas, AHXing, XArmstrong, KABullock, ANCuny, GDYu, PB Development of an ALK2-Biased BMP Type I Receptor Kinase Inhibitor. ACS Chem Biol 8:1291-302 (2013)  
Target
Name:
Activin receptor type-1B
Synonyms:
6820432J04 ActR-IB Acvr1b Alk4 | SKR2
Type:
Mol. Mass.:
56705.93
Organism:
Mus musculus
Description:
Residue:
505
  
Inhibitor
Name:
BDBM36354
Synonyms:
4-(6-(4-isopropoxyphenyl)pyrazolo[1,5-a]pyrimidin- 3-yl)quinoline US9040694, 1
Type:
Small organic molecule
Emp. Form.:
C24H20N4O
Mol. Mass.:
380.4418
SMILES:
CC(C)Oc1ccc(cc1)-c1cnc2c(cnn2c1)-c1ccnc2ccccc12
: