Target
Tumor necrosis factor
Ligand
BDBM102666
Substrate
Meas. Tech.
Inhibition Assay
Ki
0.0524±0.0 nM
IC50
61±0.0 nM
Citation
 Kozlowski, JAYu, WWong, MKKim, SHTong, LLavey, BJShankar, BBYang, DFeltz, RKosinski, AMZhou, GRizvi, RKDai, CFire, LGirijavallabhan, VLi, DPopovici-Muller, JRichard, JERosner, KESiddiqui, MAYang, L Compounds for the treatment of inflammatory disorders US Patent  US8541572 Publication Date 9/24/2013 
Target
Name:
Tumor necrosis factor
Synonyms:
Cachectin TNF-a TNFA TNFSF2 Tumor necrosis factor (TNFa) Tumor necrosis factor ligand superfamily member 2 Tumor necrosis factor, soluble form | tumor necrosis factor alpha
Type:
Enzyme
Mol. Mass.:
25645.11
Organism:
Homo sapiens (Human)
Description:
P01375
Residue:
233
  
Inhibitor
Name:
BDBM102666
Synonyms:
US8541572, 973
Type:
Small organic molecule
Emp. Form.:
C30H24N6O5
Mol. Mass.:
548.5488
SMILES:
COc1ccc2CN(C[C@]3(NC(=O)NC3=O)C#Cc3ccc(cc3)-c3nc(ccc3O)-c3cnn(C)c3)C(=O)c2c1
: