Target
Kinesin-like protein KIF11
Ligand
BDBM34534
Substrate
Meas. Tech.
In Vitro Assay
IC50
1.49±n/a nM
Citation
 Abrams, TBarsanti, PDing, YDuhl, DHan, WHu, CPan, Y Triazole compounds as KSP inhibitors US Patent  US8546434 Publication Date 10/1/2013 
Target
Name:
Kinesin-like protein KIF11
Synonyms:
EG5 KIF11_HUMAN Kinesin Spindle Protein Eg5 TRIP5 | kinesin spindle protein
Type:
PROTEIN
Mol. Mass.:
119138.97
Organism:
Homo sapiens (Human)
Description:
ChEMBL_1457426
Residue:
1056
  
Inhibitor
Name:
BDBM34534
Synonyms:
US8546434, 8
Type:
Emp. Form.:
C27H33F4N5O3
Mol. Mass.:
551.5762
SMILES:
COC(C)(C)[C@@H](N(CC[C@H](N)CF)C(=O)[C@H](C)O)c1nc(nn1Cc1cccc(F)c1)-c1cc(F)ccc1F
: