Target
Lysine-specific demethylase 5A
Ligand
BDBM281261
Substrate
Meas. Tech.
KDM5 Enzyme Assay
pH
7±n/a
Temperature
298.15±n/a K
IC50
0.092±n/a nM
Comments
extracted
Citation
 Lai, KWLiang, JZhang, BLabadie, SOrtwine, DDragovich, PKiefer, JGehling, VSHarmange, J Pyrrolidine amide compounds as histone demethylase inhibitors US Patent  US10022354 Publication Date 7/17/2018 
Target
Name:
Lysine-specific demethylase 5A
Synonyms:
Histone demethylase JARID1A Jumonji/ARID domain-containing protein 1A KDM5A_HUMAN RBBP-2 RBP2 | Retinoblastoma-binding protein 2
Type:
Protein
Mol. Mass.:
192091.79
Organism:
Homo sapiens (Human)
Description:
P29375
Residue:
1690
  
Inhibitor
Name:
BDBM281261
Synonyms:
US10022354, Example 201
Type:
Small organic molecule
Emp. Form.:
C21H28N4O3
Mol. Mass.:
384.472
SMILES:
CC(C)Oc1ccccc1C(=O)NC1CCN(C1)C(=O)c1cc(n[nH]1)C(C)C
: